BDBM64914 3,5-dimethyl-4-isoxazolecarboxylic acid [2-(4-amino-1-methyl-2,6-dioxo-3-propyl-5-pyrimidinyl)-2-oxoethyl] ester::3,5-dimethylisoxazole-4-carboxylic acid [2-(4-amino-2,6-diketo-1-methyl-3-propyl-pyrimidin-5-yl)-2-keto-ethyl] ester::MLS000054929::SMR000066873::[2-(4-amino-1-methyl-2,6-dioxo-3-propylpyrimidin-5-yl)-2-oxoethyl] 3,5-dimethyl-1,2-oxazole-4-carboxylate::[2-[4-azanyl-1-methyl-2,6-bis(oxidanylidene)-3-propyl-pyrimidin-5-yl]-2-oxidanylidene-ethyl] 3,5-dimethyl-1,2-oxazole-4-carboxylate::cid_2115012
SMILES CCCn1c(N)c(C(=O)COC(=O)c2c(C)noc2C)c(=O)n(C)c1=O
InChI Key InChIKey=AAHZIIKQJCMENQ-UHFFFAOYSA-N
Data  1 EC50
  Tab Delimited (TSV)   2D SDfile   Computed 3D by Vconf -m prep SDfile
Find this compound or compounds like it in BindingDB:
Activity Spreadsheet -- Enzyme Inhibition Constant Data from BindingDB
Found 1 hit for monomerid = 64914
TargetATP-dependent molecular chaperone HSP82(Candida albicans)
Broad Institute
Curated by PubChem BioAssay
LigandPNGBDBM64914(3,5-dimethyl-4-isoxazolecarboxylic acid [2-(4-amin...)
Affinity DataEC50: >1.50E+5nM. Assay description: Broad Institute: Reversing Antifungal Drug Resistance Project ID: 2037 Keywords: Candida albicans, drug resistance, Fluconazole, Hsp90, Calcineurin, ...
In DepthDetails PCBioAssay